{"text_format":"1","workbook":"xlsx","n_sheets":5,"sheets":["Summary","Read_Me","InputsandResults","Coeff","Calc"],"not_rendered":{"charts":4,"images":0,"macros":1,"external_links":0,"defined_names":8,"comments":0,"pivot_tables":0},"unopened":[],"bounds":{"document_bytes":16777216,"sheet_cells":100000,"rows_first":2000,"rows_last":500,"rows_between":2000,"halvings":0,"cell_chars":16384,"cell_head_chars":4096},"cells_cut":0,"cells_raw":0,"read":"whole","date_system":"1900"}

{"sheet":"Summary","index":0,"n_rows":22,"n_cols":2,"rows_kept":22,"cut":false,"hidden":false,"merged":[]}
["Model Title","Updated Baseline Cost Model for Hydropower (2023)"]
["Keywords","Hydropower costs, Baseline costs, Hydropower cost modeling"]
["Originator","Oak Ridge National Laboratory"]
["Creator","Gbadebo A. Oladosu (oladosuga@ornl.gov), Colin Sasthav (colin.sasthav@ee.doe.gov)"]
["Publication Date","March/31/2023"]
["Updated"]
["Online Linkage"]
["DOI"]
{"$rows_left_out":15}
{"sheet":"Read_Me","index":1,"n_rows":43,"n_cols":3,"rows_kept":43,"cut":false,"hidden":false,"merged":[[0,0,0,5],[17,0,17,2],[16,0,16,2],[1,0,1,5],[11,0,11,5],[9,0,9,5],[8,0,8,5],[2,0,2,5],[10,0,10,5],[4,0,4,5],[6,0,6,5],[7,0,7,5],[3,0,3,5],[5,0,5,5]]}
["Authors:  Gbadebo Oladosu, Colin Sasthav (2023)"]
["Read the Instructions below before exercising this version of the BCM model"]
["NOTE: Do not change contents of tables or table headers unless explicitly instructed below"]
["INSTRUCTIONS"]
["STATUS: As of 11/21/2022 the BCM has been re-estimated with data compiled in 2022, merging data available from the 2015 model version with newer data. The revised model also uses a more comprehensive specfication that allows available data for each project type to be considered in a single regression, thus mitigating degree of freedom issues from estimating models with partitions of the data based on project characteristics. A weighted regression method also proved to improve model fit in most cases relative to the 2015 version of the model."]
["MODEL APPLICATION NOTES: This workbook provides updated versions of equations in the ORNL Baseline Cost Model (BCM), which was original published in 2015 (O'Connor et al., 2015). This version incorporates updated data (from the same sources as the 2015 version) and re-specified equations (see Table 2 below and the \"Coeff\" sheet). The underlying cost data are for existing or planned projects. Therefore the cost estimates from the model may, in most cases,  be interpreted as lower bounds on future projects cost as newer hydropower projects tend to have smaller and highly variable resource potentials, different infrastructure requirements, along with stricter environmental requirements, relative to existing projects  (see Oladosu et al., 2021; Oladosu et al., 2021a)."]
["MODEL USE STEPS"]
["1. INPUT PROJECT DATA: a) Specify the number of projects (limited to 100) to be evaluated in cell \"D19\" of the \"InputsandResults\" sheet. This will expand or contract the number of rows in Table 1 to the specified number by hiding or showing rows up to the limit of 100. b) Input the data for your projects under the \"USER INPUTS\" columns of Table 1. Required project inputs are: 1) Project Name = Enter unique project Name; 2) Project Type (Click on the Cell to Select); 3) Capacity: set project capacity (MW) at completion; 4) Added_Capcity (MW): set additional capacity due to project - this is the same for most project types, except for \"Capacity Expansion\" projects;  5) Head: set project head (feet); 5) Project Stage (Click on the Cell to Select from \"Construction\", \"Engineering\" or \"Planning\")."]
{"$rows_left_out":36}
{"sheet":"InputsandResults","index":2,"n_rows":122,"n_cols":8,"rows_kept":122,"cut":false,"hidden":false,"merged":[[19,0,19,5],[19,6,19,7]]}
["Charts for the first 5 rows of TABLE 1 (Note: filtering out any of the first 5 rows will reduce the number of projects shown)"]
[]
[]
[]
[]
[]
[]
[]
{"$rows_left_out":115}
{"sheet":"Coeff","index":3,"n_rows":250,"n_cols":18,"rows_kept":250,"cut":false,"hidden":false,"merged":[]}
["TABLE 4: COEFFICIENTS TABLE",null,null,null,null,null,null,null,null,null,null,null,null,null,null,null,"TABLE 3: PROJECT EQUATIONS"]
["Type","Equation","Variable","Estimate","Std. Error","t value","Pr(>|t|)","R2","pseudoR2","ssiz","scal","mult0","RMSE","RMSEAll"]
["Non-Powered Dam (NPD)","NPD1","(Intercept)",1.37442707398054,0.70353965529638995,1.95358863375159,5.1424625101472998E-2,0.85185298459507397,0.85603595914768305,426,1.26435793976911,0.77118609078632105,51787.1753701497,51787.1753701497,null,null,"Project Types"," Model Equation"]
["Non-Powered Dam (NPD)","NPD1","lgEFlow",0.84015748058192896,4.5308650331343098E-2,18.5429818464651,2.77244614339416E-56,0.85185298459507397,0.85603595914768305,426,1.26435793976911,0.77118609078632105,51787.1753701497,51787.1753701497,null,null,"Non-Powered Dam (NPD)","NPD3"]
["Non-Powered Dam (NPD)","NPD1","lgHead",0.67915369355833799,7.9208101111813006E-2,8.5742958614753295,2.0231091073230099E-16,0.85185298459507397,0.85603595914768305,426,1.26435793976911,0.77118609078632105,51787.1753701497,51787.1753701497,null,null,"New Stream Development (NSD)","NSD1"]
["Non-Powered Dam (NPD)","NPD1","C",0.39361096824206399,9.2122539140989404E-2,4.2726890933787596,2.39980508436103E-5,0.85185298459507397,0.85603595914768305,426,1.26435793976911,0.77118609078632105,51787.1753701497,51787.1753701497,null,null,"Canal/Conduit","Canal3"]
["Non-Powered Dam (NPD)","NPD1","E",0.226322113201092,9.53140170635563E-2,2.3744892952122498,1.8029377817006E-2,0.85185298459507397,0.85603595914768305,426,1.26435793976911,0.77118609078632105,51787.1753701497,51787.1753701497,null,null,"Pumped Storage Hydro (PSH)","PSH4"]
["Non-Powered Dam (NPD)","NPD1","Hd30",-0.23459115623468599,0.17648816397484099,-1.3292175007731799,0.184510018806091,0.85185298459507397,0.85603595914768305,426,1.26435793976911,0.77118609078632105,51787.1753701497,51787.1753701497,null,null,"Capacity Expansion","KXP1"]
{"$rows_left_out":243}
{"sheet":"Calc","index":4,"n_rows":103,"n_cols":31,"rows_kept":103,"cut":false,"hidden":true,"merged":[[0,0,0,8],[0,10,0,30]]}
["Input Data",null,null,null,null,null,null,null,null,"Capital Expenditure Model","Endogenous Variable Calculations"]
["Unique Project Name","Project Type (Drop-down)","Project Capacity (MW)","Added Capacity (MW)","Project Head (ft)","Project Stage","Year ( Fixed at 2021)","Construction (Yes=1; No=0)","Engineering (Yes=1; No=0)","Estimated Capital Expenditure (2020$million)","Model Equation","Estimated Flow (cfs)","<= 1MW  Capacity Indicator",">1MW & <= 10MW  Capacity Indicator",">10MW & <= 30MW  Capacity Indicator",">30MW & <= 100MW  Capacity Indicator","<= 1MW  Capacity Indicator",">1MW & <= 10MW  Capacity Indicator",">10MW & <= 30MW  Capacity Indicator","<= 30ft Head Indicator",">30ft & <= 60ft Head Indicator",">60ft & <= 100ft Head Indicator","(2021 minus Year)+1","40 year ",">40 years","Intercept Term","Nat Log of Capacity","Nat Log of Added Capacity","Nat Log of Head","Nat Log of Eflow","Nat Log of tyr"]
["Project Name","Type","Capacity","Added_Capacity","Head","Stage","Year","C","E","CapEx","Equation","Eflow","Cap1","Cap10","Cap30","Cap100","addCap1","addCap10","addCap30","Hd30","Hd60","Hd100","tyr","dmy40","dmy40x","(Intercept)","lgCapacity","lgAdded_Capacity","lgHead","lgEFlow","lgtyr"]
[{"$f":"INDEX(InputsResults[Project Name],ROW()-ROW($A$3))","v":"Unknown1"},{"$f":"INDEX(InputsResults[Project Type],ROW()-ROW($A$3))","v":"Non-Powered Dam (NPD)"},{"$f":"INDEX(InputsResults[Capacity (MW)],ROW()-ROW($A$3))","v":50},{"$f":"INDEX(InputsResults[Added_Capacity],ROW()-ROW($A$3))","v":50},{"$f":"INDEX(InputsResults[Head (ft)],ROW()-ROW($A$3))","v":30},{"$f":"INDEX(InputsResults[Stage],ROW()-ROW($A$3))","v":"Construction"},2021,{"$f":"IF(Model[[#This Row],[Stage]]=\"Construction\",1,0)","v":1},{"$f":"IF(Model[[#This Row],[Stage]]=\"Engineering\",1,0)","v":0},{"$f":"INDEX(Coeff[scal],_xlfn.XMATCH(Model[[#This Row],[Equation]],Coeff[Equation]))*EXP(SUMPRODUCT(Coeff[Estimate]*(Coeff[Equation]=Model[[#This Row],[Equation]]),INDEX(Model[#This Row],,_xlfn.XMATCH(Coeff[Variable],Model[#Headers]))))/1000","v":229.19616133402647},{"$f":"INDEX('Coeff'!$R$4:$R$9,_xlfn.XMATCH(Model[[#This Row],[Type]],'Coeff'!$Q$4:$Q$9))","v":"NPD3"},{"$f":"3.28084*35.3147*1000*Model[[#This Row],[Capacity]]/(0.9*9.81*Model[[#This Row],[Head]])","v":21871.461537357951},{"$f":"IF(Model[[#This Row],[Capacity]]<=1,1,0)","v":0},{"$f":"IF(AND(Model[[#This Row],[Capacity]]>1,Model[[#This Row],[Capacity]]<=10),1,0)","v":0},{"$f":"IF(AND(Model[[#This Row],[Capacity]]>10,Model[[#This Row],[Capacity]]<=30),1,0)","v":0},{"$f":"IF(AND(Model[[#This Row],[Capacity]]>30,Model[[#This Row],[Capacity]]<=100),1,0)","v":1},{"$f":"IF(Model[[#This Row],[Added_Capacity]]<=1,1,0)","v":0},{"$f":"IF(AND(Model[[#This Row],[Added_Capacity]]>1,Model[[#This Row],[Added_Capacity]]<=10),1,0)","v":0},{"$f":"IF(AND(Model[[#This Row],[Added_Capacity]]>10,Model[[#This Row],[Added_Capacity]]<=30),1,0)","v":0},{"$f":"IF(Model[[#This Row],[Head]]<=30,1,0)","v":1},{"$f":"IF(AND(Model[[#This Row],[Head]]>10,Model[[#This Row],[Head]]<=60),1,0)","v":1},{"$f":"IF(AND(Model[[#This Row],[Capacity]]>60,Model[[#This Row],[Capacity]]<=100),1,0)","v":0},{"$f":"2021-Model[[#This Row],[Year]]+1","v":1},{"$f":"IF(AND(ROUND(Model[[#This Row],[tyr]]/20,0)>2,ROUND(Model[[#This Row],[tyr]]/20,0)<3),1,0)","v":0},{"$f":"IF(ROUND(Model[[#This Row],[tyr]]/20,0)>=3,1,0)","v":0},{"$f":"1","v":1},{"$f":"LN(Model[[#This Row],[Capacity]])","v":3.912023005428146},{"$f":"LN(Model[[#This Row],[Added_Capacity]])","v":3.912023005428146},{"$f":"LN(Model[[#This Row],[Head]])","v":3.4011973816621555},{"$f":"LN(Model[[#This Row],[Eflow]])","v":9.9929379398493232},{"$f":"LN(Model[[#This Row],[tyr]])","v":0}]
[{"$f":"INDEX(InputsResults[Project Name],ROW()-ROW($A$3))","v":0},{"$f":"INDEX(InputsResults[Project Type],ROW()-ROW($A$3))","v":0},{"$f":"INDEX(InputsResults[Capacity (MW)],ROW()-ROW($A$3))","v":0},{"$f":"INDEX(InputsResults[Added_Capacity],ROW()-ROW($A$3))","v":0},{"$f":"INDEX(InputsResults[Head (ft)],ROW()-ROW($A$3))","v":0},{"$f":"INDEX(InputsResults[Stage],ROW()-ROW($A$3))","v":0},2021,{"$f":"IF(Model[[#This Row],[Stage]]=\"Construction\",1,0)","v":0},{"$f":"IF(Model[[#This Row],[Stage]]=\"Engineering\",1,0)","v":0},{"$f":"INDEX(Coeff[scal],_xlfn.XMATCH(Model[[#This Row],[Equation]],Coeff[Equation]))*EXP(SUMPRODUCT(Coeff[Estimate]*(Coeff[Equation]=Model[[#This Row],[Equation]]),INDEX(Model[#This Row],,_xlfn.XMATCH(Coeff[Variable],Model[#Headers]))))/1000","v":{"$error":"#N/A"}},{"$f":"INDEX('Coeff'!$R$4:$R$9,_xlfn.XMATCH(Model[[#This Row],[Type]],'Coeff'!$Q$4:$Q$9))","v":{"$error":"#N/A"}},{"$f":"3.28084*35.3147*1000*Model[[#This Row],[Capacity]]/(0.9*9.81*Model[[#This Row],[Head]])","v":{"$error":"#DIV/0!"}},{"$f":"IF(Model[[#This Row],[Capacity]]<=1,1,0)","v":1},{"$f":"IF(AND(Model[[#This Row],[Capacity]]>1,Model[[#This Row],[Capacity]]<=10),1,0)","v":0},{"$f":"IF(AND(Model[[#This Row],[Capacity]]>10,Model[[#This Row],[Capacity]]<=30),1,0)","v":0},{"$f":"IF(AND(Model[[#This Row],[Capacity]]>30,Model[[#This Row],[Capacity]]<=100),1,0)","v":0},{"$f":"IF(Model[[#This Row],[Added_Capacity]]<=1,1,0)","v":1},{"$f":"IF(AND(Model[[#This Row],[Added_Capacity]]>1,Model[[#This Row],[Added_Capacity]]<=10),1,0)","v":0},{"$f":"IF(AND(Model[[#This Row],[Added_Capacity]]>10,Model[[#This Row],[Added_Capacity]]<=30),1,0)","v":0},{"$f":"IF(Model[[#This Row],[Head]]<=30,1,0)","v":1},{"$f":"IF(AND(Model[[#This Row],[Head]]>10,Model[[#This Row],[Head]]<=60),1,0)","v":0},{"$f":"IF(AND(Model[[#This Row],[Capacity]]>60,Model[[#This Row],[Capacity]]<=100),1,0)","v":0},{"$f":"2021-Model[[#This Row],[Year]]+1","v":1},{"$f":"IF(AND(ROUND(Model[[#This Row],[tyr]]/20,0)>2,ROUND(Model[[#This Row],[tyr]]/20,0)<3),1,0)","v":0},{"$f":"IF(ROUND(Model[[#This Row],[tyr]]/20,0)>=3,1,0)","v":0},{"$f":"1","v":1},{"$f":"LN(Model[[#This Row],[Capacity]])","v":{"$error":"#NUM!"}},{"$f":"LN(Model[[#This Row],[Added_Capacity]])","v":{"$error":"#NUM!"}},{"$f":"LN(Model[[#This Row],[Head]])","v":{"$error":"#NUM!"}},{"$f":"LN(Model[[#This Row],[Eflow]])","v":{"$error":"#DIV/0!"}},{"$f":"LN(Model[[#This Row],[tyr]])","v":0}]
[{"$f":"INDEX(InputsResults[Project Name],ROW()-ROW($A$3))","v":0},{"$f":"INDEX(InputsResults[Project Type],ROW()-ROW($A$3))","v":0},{"$f":"INDEX(InputsResults[Capacity (MW)],ROW()-ROW($A$3))","v":0},{"$f":"INDEX(InputsResults[Added_Capacity],ROW()-ROW($A$3))","v":0},{"$f":"INDEX(InputsResults[Head (ft)],ROW()-ROW($A$3))","v":0},{"$f":"INDEX(InputsResults[Stage],ROW()-ROW($A$3))","v":0},2021,{"$f":"IF(Model[[#This Row],[Stage]]=\"Construction\",1,0)","v":0},{"$f":"IF(Model[[#This Row],[Stage]]=\"Engineering\",1,0)","v":0},{"$f":"INDEX(Coeff[scal],_xlfn.XMATCH(Model[[#This Row],[Equation]],Coeff[Equation]))*EXP(SUMPRODUCT(Coeff[Estimate]*(Coeff[Equation]=Model[[#This Row],[Equation]]),INDEX(Model[#This Row],,_xlfn.XMATCH(Coeff[Variable],Model[#Headers]))))/1000","v":{"$error":"#N/A"}},{"$f":"INDEX('Coeff'!$R$4:$R$9,_xlfn.XMATCH(Model[[#This Row],[Type]],'Coeff'!$Q$4:$Q$9))","v":{"$error":"#N/A"}},{"$f":"3.28084*35.3147*1000*Model[[#This Row],[Capacity]]/(0.9*9.81*Model[[#This Row],[Head]])","v":{"$error":"#DIV/0!"}},{"$f":"IF(Model[[#This Row],[Capacity]]<=1,1,0)","v":1},{"$f":"IF(AND(Model[[#This Row],[Capacity]]>1,Model[[#This Row],[Capacity]]<=10),1,0)","v":0},{"$f":"IF(AND(Model[[#This Row],[Capacity]]>10,Model[[#This Row],[Capacity]]<=30),1,0)","v":0},{"$f":"IF(AND(Model[[#This Row],[Capacity]]>30,Model[[#This Row],[Capacity]]<=100),1,0)","v":0},{"$f":"IF(Model[[#This Row],[Added_Capacity]]<=1,1,0)","v":1},{"$f":"IF(AND(Model[[#This Row],[Added_Capacity]]>1,Model[[#This Row],[Added_Capacity]]<=10),1,0)","v":0},{"$f":"IF(AND(Model[[#This Row],[Added_Capacity]]>10,Model[[#This Row],[Added_Capacity]]<=30),1,0)","v":0},{"$f":"IF(Model[[#This Row],[Head]]<=30,1,0)","v":1},{"$f":"IF(AND(Model[[#This Row],[Head]]>10,Model[[#This Row],[Head]]<=60),1,0)","v":0},{"$f":"IF(AND(Model[[#This Row],[Capacity]]>60,Model[[#This Row],[Capacity]]<=100),1,0)","v":0},{"$f":"2021-Model[[#This Row],[Year]]+1","v":1},{"$f":"IF(AND(ROUND(Model[[#This Row],[tyr]]/20,0)>2,ROUND(Model[[#This Row],[tyr]]/20,0)<3),1,0)","v":0},{"$f":"IF(ROUND(Model[[#This Row],[tyr]]/20,0)>=3,1,0)","v":0},{"$f":"1","v":1},{"$f":"LN(Model[[#This Row],[Capacity]])","v":{"$error":"#NUM!"}},{"$f":"LN(Model[[#This Row],[Added_Capacity]])","v":{"$error":"#NUM!"}},{"$f":"LN(Model[[#This Row],[Head]])","v":{"$error":"#NUM!"}},{"$f":"LN(Model[[#This Row],[Eflow]])","v":{"$error":"#DIV/0!"}},{"$f":"LN(Model[[#This Row],[tyr]])","v":0}]
[{"$f":"INDEX(InputsResults[Project Name],ROW()-ROW($A$3))","v":0},{"$f":"INDEX(InputsResults[Project Type],ROW()-ROW($A$3))","v":0},{"$f":"INDEX(InputsResults[Capacity (MW)],ROW()-ROW($A$3))","v":0},{"$f":"INDEX(InputsResults[Added_Capacity],ROW()-ROW($A$3))","v":0},{"$f":"INDEX(InputsResults[Head (ft)],ROW()-ROW($A$3))","v":0},{"$f":"INDEX(InputsResults[Stage],ROW()-ROW($A$3))","v":0},2021,{"$f":"IF(Model[[#This Row],[Stage]]=\"Construction\",1,0)","v":0},{"$f":"IF(Model[[#This Row],[Stage]]=\"Engineering\",1,0)","v":0},{"$f":"INDEX(Coeff[scal],_xlfn.XMATCH(Model[[#This Row],[Equation]],Coeff[Equation]))*EXP(SUMPRODUCT(Coeff[Estimate]*(Coeff[Equation]=Model[[#This Row],[Equation]]),INDEX(Model[#This Row],,_xlfn.XMATCH(Coeff[Variable],Model[#Headers]))))/1000","v":{"$error":"#N/A"}},{"$f":"INDEX('Coeff'!$R$4:$R$9,_xlfn.XMATCH(Model[[#This Row],[Type]],'Coeff'!$Q$4:$Q$9))","v":{"$error":"#N/A"}},{"$f":"3.28084*35.3147*1000*Model[[#This Row],[Capacity]]/(0.9*9.81*Model[[#This Row],[Head]])","v":{"$error":"#DIV/0!"}},{"$f":"IF(Model[[#This Row],[Capacity]]<=1,1,0)","v":1},{"$f":"IF(AND(Model[[#This Row],[Capacity]]>1,Model[[#This Row],[Capacity]]<=10),1,0)","v":0},{"$f":"IF(AND(Model[[#This Row],[Capacity]]>10,Model[[#This Row],[Capacity]]<=30),1,0)","v":0},{"$f":"IF(AND(Model[[#This Row],[Capacity]]>30,Model[[#This Row],[Capacity]]<=100),1,0)","v":0},{"$f":"IF(Model[[#This Row],[Added_Capacity]]<=1,1,0)","v":1},{"$f":"IF(AND(Model[[#This Row],[Added_Capacity]]>1,Model[[#This Row],[Added_Capacity]]<=10),1,0)","v":0},{"$f":"IF(AND(Model[[#This Row],[Added_Capacity]]>10,Model[[#This Row],[Added_Capacity]]<=30),1,0)","v":0},{"$f":"IF(Model[[#This Row],[Head]]<=30,1,0)","v":1},{"$f":"IF(AND(Model[[#This Row],[Head]]>10,Model[[#This Row],[Head]]<=60),1,0)","v":0},{"$f":"IF(AND(Model[[#This Row],[Capacity]]>60,Model[[#This Row],[Capacity]]<=100),1,0)","v":0},{"$f":"2021-Model[[#This Row],[Year]]+1","v":1},{"$f":"IF(AND(ROUND(Model[[#This Row],[tyr]]/20,0)>2,ROUND(Model[[#This Row],[tyr]]/20,0)<3),1,0)","v":0},{"$f":"IF(ROUND(Model[[#This Row],[tyr]]/20,0)>=3,1,0)","v":0},{"$f":"1","v":1},{"$f":"LN(Model[[#This Row],[Capacity]])","v":{"$error":"#NUM!"}},{"$f":"LN(Model[[#This Row],[Added_Capacity]])","v":{"$error":"#NUM!"}},{"$f":"LN(Model[[#This Row],[Head]])","v":{"$error":"#NUM!"}},{"$f":"LN(Model[[#This Row],[Eflow]])","v":{"$error":"#DIV/0!"}},{"$f":"LN(Model[[#This Row],[tyr]])","v":0}]
[{"$f":"INDEX(InputsResults[Project Name],ROW()-ROW($A$3))","v":0},{"$f":"INDEX(InputsResults[Project Type],ROW()-ROW($A$3))","v":0},{"$f":"INDEX(InputsResults[Capacity (MW)],ROW()-ROW($A$3))","v":0},{"$f":"INDEX(InputsResults[Added_Capacity],ROW()-ROW($A$3))","v":0},{"$f":"INDEX(InputsResults[Head (ft)],ROW()-ROW($A$3))","v":0},{"$f":"INDEX(InputsResults[Stage],ROW()-ROW($A$3))","v":0},2021,{"$f":"IF(Model[[#This Row],[Stage]]=\"Construction\",1,0)","v":0},{"$f":"IF(Model[[#This Row],[Stage]]=\"Engineering\",1,0)","v":0},{"$f":"INDEX(Coeff[scal],_xlfn.XMATCH(Model[[#This Row],[Equation]],Coeff[Equation]))*EXP(SUMPRODUCT(Coeff[Estimate]*(Coeff[Equation]=Model[[#This Row],[Equation]]),INDEX(Model[#This Row],,_xlfn.XMATCH(Coeff[Variable],Model[#Headers]))))/1000","v":{"$error":"#N/A"}},{"$f":"INDEX('Coeff'!$R$4:$R$9,_xlfn.XMATCH(Model[[#This Row],[Type]],'Coeff'!$Q$4:$Q$9))","v":{"$error":"#N/A"}},{"$f":"3.28084*35.3147*1000*Model[[#This Row],[Capacity]]/(0.9*9.81*Model[[#This Row],[Head]])","v":{"$error":"#DIV/0!"}},{"$f":"IF(Model[[#This Row],[Capacity]]<=1,1,0)","v":1},{"$f":"IF(AND(Model[[#This Row],[Capacity]]>1,Model[[#This Row],[Capacity]]<=10),1,0)","v":0},{"$f":"IF(AND(Model[[#This Row],[Capacity]]>10,Model[[#This Row],[Capacity]]<=30),1,0)","v":0},{"$f":"IF(AND(Model[[#This Row],[Capacity]]>30,Model[[#This Row],[Capacity]]<=100),1,0)","v":0},{"$f":"IF(Model[[#This Row],[Added_Capacity]]<=1,1,0)","v":1},{"$f":"IF(AND(Model[[#This Row],[Added_Capacity]]>1,Model[[#This Row],[Added_Capacity]]<=10),1,0)","v":0},{"$f":"IF(AND(Model[[#This Row],[Added_Capacity]]>10,Model[[#This Row],[Added_Capacity]]<=30),1,0)","v":0},{"$f":"IF(Model[[#This Row],[Head]]<=30,1,0)","v":1},{"$f":"IF(AND(Model[[#This Row],[Head]]>10,Model[[#This Row],[Head]]<=60),1,0)","v":0},{"$f":"IF(AND(Model[[#This Row],[Capacity]]>60,Model[[#This Row],[Capacity]]<=100),1,0)","v":0},{"$f":"2021-Model[[#This Row],[Year]]+1","v":1},{"$f":"IF(AND(ROUND(Model[[#This Row],[tyr]]/20,0)>2,ROUND(Model[[#This Row],[tyr]]/20,0)<3),1,0)","v":0},{"$f":"IF(ROUND(Model[[#This Row],[tyr]]/20,0)>=3,1,0)","v":0},{"$f":"1","v":1},{"$f":"LN(Model[[#This Row],[Capacity]])","v":{"$error":"#NUM!"}},{"$f":"LN(Model[[#This Row],[Added_Capacity]])","v":{"$error":"#NUM!"}},{"$f":"LN(Model[[#This Row],[Head]])","v":{"$error":"#NUM!"}},{"$f":"LN(Model[[#This Row],[Eflow]])","v":{"$error":"#DIV/0!"}},{"$f":"LN(Model[[#This Row],[tyr]])","v":0}]
{"$rows_left_out":95}